{"text_format":"1","workbook":"xlsx","n_sheets":7,"sheets":["ISOLINE","OBJ ISOLINE","PRIM","OBJ PRIM","LOCO","OBJ LOCO","Tabulky"],"not_rendered":{"charts":0,"images":1,"macros":1,"external_links":1,"defined_names":3,"comments":3,"pivot_tables":0},"unopened":[],"bounds":{"document_bytes":16777216,"sheet_cells":100000,"rows_first":2000,"rows_last":500,"rows_between":2000,"halvings":0,"cell_chars":16384,"cell_head_chars":4096},"cells_cut":0,"cells_raw":0,"read":"whole","date_system":"1900"}

{"sheet":"ISOLINE","index":0,"n_rows":60,"n_cols":21,"rows_kept":60,"cut":false,"hidden":true,"merged":[[43,0,43,17],[44,0,44,17],[46,18,46,19],[47,18,47,19],[3,15,3,16],[4,15,4,16],[6,0,6,20],[7,0,7,20],[15,0,16,0],[48,18,48,19],[43,18,43,19],[54,3,54,6],[42,18,42,19],[38,19,38,20],[49,18,49,19],[41,0,41,17],[42,0,42,17],[45,0,45,17],[46,0,46,17],[47,0,47,17],[48,0,48,17],[49,0,49,17],[41,18,41,19],[45,18,45,19],[44,18,44,19]]}
[null,null,null,null,null,null,null,null,null,null,null,null,null,null,"PROVOZOVNA:","Žerotínova 87"]
[null,null,null,null,null,null,null,null,null,null,null,null,null,null,null,"areál Na Bělidle"]
[null,null,null,null,null,null,null,null,null,null,null,null,null,null,null,"787 01 Šumperk"]
[null,null,null,null,null,null,null,null,null,null,null,null,null,null,"Region:",{"$f":"[1]Úvod!$G$7","v":"Šumperk"}]
["Stará 205 , 789 61, Bludov",null,null,null,null,null,"www.parapetyrs.cz",null,null,null,null,null,null,null,"Vyhotovil:",{"$f":"[1]Úvod!$G$8","v":"Baženov"}]
[]
["Ceník ISOLINE žaluzií pro firmu"]
[{"$f":"'[1]Žaluzie KASKO'!$N$4","v":"INTERNET "}]
[]
["Typ:",null,"Sdružené ovládání pomocí řetízku - barva bílá, stříbrná, béžová, hnědá, světle hnědá"]
{"$rows_left_out":51}
{"sheet":"OBJ ISOLINE","index":1,"n_rows":33,"n_cols":38,"rows_kept":33,"cut":false,"hidden":false,"merged":[[31,0,31,17],[32,0,32,17],[1,14,1,17],[2,14,2,17],[3,14,3,17],[4,14,4,17],[5,14,5,17],[6,14,6,17],[7,14,7,17],[6,7,6,10],[7,7,7,10],[3,5,3,6],[4,5,4,6],[5,5,5,6],[6,5,6,6],[7,5,7,6],[6,13,7,13],[1,11,1,13],[0,0,0,17],[8,0,9,0],[8,1,9,1],[8,2,9,2],[8,3,9,3],[8,4,8,5],[1,5,1,10],[2,5,2,10],[2,11,2,12],[4,11,4,12],[5,11,5,12],[3,7,3,10],[4,7,4,10],[5,7,5,10],[8,10,9,10],[8,11,9,11],[8,12,9,12],[6,11,7,12],[3,11,3,12],[6,0,6,4],[7,0,7,4],[8,6,9,6],[8,7,8,8],[8,9,9,9],[1,0,1,4],[2,0,2,4],[3,0,3,4],[4,0,4,4],[5,0,5,4],[8,14,9,14],[8,15,9,15],[8,16,9,16],[8,17,9,17],[8,13,9,13]]}
["Objednávka žaluzií - ISOLINE"]
["Objednatel:",null,null,null,null,"List č. 1  z  1",null,null,null,null,null,"Souhrn objednávky:"]
[{"$f":"ISOLINE!A8","v":"INTERNET "},null,null,null,null,"(příklad: List č. 1   z.  5)",null,null,null,null,null,"Platnost od:",null,{"$f":"ISOLINE!$D$55","v":"2018-10-16"}]
[null,null,null,null,null,"Datum objednání:",null,null,null,null,null,"Plocha m²:",null,{"$f":"SUM(V11:V31)","v":0}]
[null,null,null,null,null,"Datum dodání:",null,null,null,null,null,"Kusů:",null,{"$f":"SUM(G11:G31)","v":0},"Stará 205, 789 61, Bludov"]
["IČ:",null,null,null,null,"Adresa dodání:",null,null,null,null,null,"Rabat, marže:",null,0,"Provozovna:"]
[null,null,null,null,null,"Kontakt:",null,null,null,null,null,"Přibližná cena bez DPH:",null,{"$f":"SUM(Q11:Q31)","v":0},"ul. Žerotínova 87, 787 01, Šumperk"]
[null,null,null,null,null,"Zakázka:",null,null,null,null,null,null,null,null,"bývalý areál Moravolenu (Bělidlo)"]
["Pozice","Lamela","Ovl.","Profil","Rozměr (v mm)",null,"ks","Barva",null,"Celostín","Rám okna","Podl. (pár)","Bezpeč. prvky","Délka ovl.         ( v mm)","m²","Cena kus","Cena celkem","Poznámka"]
[null,null,null,null,"Šířka","Výška",null,"Lamely","Profilů",null,null,null,null,null,null,null,null,null,null,null,null,"m2 řádek","šířka zaok","výška zaok","m2","příp barva lamela","příp profil","příp barva profilu","příp síla lamely","Š index","V index","Cena index","Cena jednotka","Cena vše","Dist. Podložka","Bezpečnostní prvky","Marže ks","Marže vše"]
{"$rows_left_out":24}
{"sheet":"PRIM","index":2,"n_rows":61,"n_cols":21,"rows_kept":61,"cut":false,"hidden":true,"merged":[[43,0,43,17],[43,18,43,19],[37,19,37,20],[3,15,3,16],[4,15,4,16],[6,0,6,20],[7,0,7,20],[14,0,15,0],[40,0,40,17],[40,18,40,19],[41,0,41,17],[41,18,41,19],[42,0,42,17],[42,18,42,19],[44,0,44,17],[44,18,44,19],[45,0,45,17],[45,18,45,19],[48,0,48,17],[48,18,48,19],[49,0,49,17],[49,18,49,19],[55,3,55,6],[46,0,46,17],[46,18,46,19],[47,0,47,17],[47,18,47,19]]}
[null,null,null,null,null,null,null,null,null,null,null,null,null,null,"PROVOZOVNA:","Žerotínova 87"]
[null,null,null,null,null,null,null,null,null,null,null,null,null,null,null,"areál Na Bělidle"]
[null,null,null,null,null,null,null,null,null,null,null,null,null,null,null,"787 01 Šumperk"]
[null,null,null,null,null,null,null,null,null,null,null,null,null,null,"Region:",{"$f":"[1]Úvod!$G$7","v":"Šumperk"}]
["Stará 205 , 789 61, Bludov",null,null,null,null,null,"www.parapetyrs.cz",null,null,null,null,null,null,null,"Vyhotovil:",{"$f":"[1]Úvod!$G$8","v":"Baženov"}]
[]
["Ceník ISOLINE - PRIM žaluzií pro firmu"]
[{"$f":"'[1]Žaluzie KASKO'!$N$4","v":"INTERNET "}]
[]
["Typ:",null,"Sdružené ovládání pomocí řetízku - barva bílá, stříbrná, béžová, hnědá, světle hnědá"]
{"$rows_left_out":52}
{"sheet":"OBJ PRIM","index":3,"n_rows":33,"n_cols":39,"rows_kept":33,"cut":false,"hidden":false,"merged":[[0,0,0,18],[1,0,1,4],[1,12,1,14],[1,15,1,18],[2,0,2,4],[2,12,2,13],[2,15,2,18],[3,0,3,4],[3,5,3,6],[3,12,3,13],[3,15,3,18],[4,0,4,4],[4,5,4,6],[4,12,4,13],[4,15,4,18],[5,0,5,4],[5,5,5,6],[5,12,5,13],[5,15,5,18],[6,0,6,4],[6,5,6,6],[6,12,7,13],[6,14,7,14],[7,0,7,4],[7,5,7,6],[7,15,7,18],[8,0,9,0],[8,1,9,1],[8,2,9,2],[8,3,9,3],[8,4,8,5],[8,9,9,9],[8,10,9,10],[8,12,9,12],[8,13,9,13],[6,15,6,18],[32,0,32,18],[1,5,1,11],[2,5,2,11],[3,7,3,11],[4,7,4,11],[5,7,5,11],[6,7,6,11],[7,7,7,11],[8,14,9,14],[8,15,9,15],[8,16,9,16],[8,17,9,17],[8,18,9,18],[31,0,31,18],[8,6,9,6],[8,7,8,8]]}
["Objednávka žaluzií - ISOLINE PRIM"]
["Objednatel:",null,null,null,null,"List č. 1  z  1",null,null,null,null,null,null,"Souhrn objednávky:"]
[{"$f":"ISOLINE!A8","v":"INTERNET "},null,null,null,null,"(příklad: List č. 1   z.  5)",null,null,null,null,null,null,"Platnost od:",null,{"$f":"ISOLINE!$D$55","v":"2018-10-16"}]
[null,null,null,null,null,"Datum objednání:",null,null,null,null,null,null,"Plocha m²:",null,{"$f":"SUM(W11:W31)","v":0}]
[null,null,null,null,null,"Datum dodání:",null,null,null,null,null,null,"Kusů:",null,{"$f":"SUM(G11:G31)","v":0},"Stará 205, 789 61, Bludov"]
["IČ:",null,null,null,null,"Adresa dodání:",null,null,null,null,null,null,"Rabat, marže:",null,0,"Provozovna:"]
[null,null,null,null,null,"Kontakt:",null,null,null,null,null,null,"Přibližná cena bez DPH:",null,{"$f":"SUM(R11:R31)","v":0},"ul. Žerotínova 87, 787 01, Šumperk"]
[null,null,null,null,null,"Zakázka:",null,null,null,null,null,null,null,null,null,"bývalý areál Moravolenu (Bělidlo)"]
["Pozice","Lamela","Ovl.","Profil","Rozměr (v mm)",null,"ks","Barva",null,"Celostín","Rám okna","Brzda","Podl. (pár)","Bezpeč. prvky","Délka ovl.         ( v mm)","m²","Cena kus","Cena celkem","Poznámka"]
[null,null,null,null,"Šířka","Výška",null,"Lamely","Profilů",null,null,"Převodovka",null,null,null,null,null,null,null,null,null,null,"m2 řádek","šířka zaok","výška zaok","m2","příp barva lamela","příp barva profilu","příp síla lamely","Š index","V index","Cena index","Cena jednotka","Cena vše","Dist. Podložka","Bezpečnostní prvky","Brzda","Marže ks","Marže vše"]
{"$rows_left_out":24}
{"sheet":"LOCO","index":4,"n_rows":60,"n_cols":21,"rows_kept":60,"cut":false,"hidden":true,"merged":[[37,19,37,20],[3,15,3,16],[4,15,4,16],[6,0,6,20],[7,0,7,20],[14,0,15,0],[44,0,44,17],[44,18,44,19],[45,0,45,17],[45,18,45,19],[40,0,40,17],[40,18,40,19],[41,0,41,17],[41,18,41,19],[42,0,42,17],[42,18,42,19],[43,0,43,17],[43,18,43,19],[54,3,54,6],[46,0,46,17],[46,18,46,19],[47,0,47,17],[47,18,47,19],[48,0,48,17],[48,18,48,19]]}
[null,null,null,null,null,null,null,null,null,null,null,null,null,null,"PROVOZOVNA:","Žerotínova 87"]
[null,null,null,null,null,null,null,null,null,null,null,null,null,null,null,"areál Na Bělidle"]
[null,null,null,null,null,null,null,null,null,null,null,null,null,null,null,"787 01 Šumperk"]
[null,null,null,null,null,null,null,null,null,null,null,null,null,null,"Region:",{"$f":"[1]Úvod!$G$7","v":"Šumperk"}]
["Stará 205 , 789 61, Bludov",null,null,null,null,null,"www.parapetyrs.cz",null,null,null,null,null,null,null,"Vyhotovil:",{"$f":"[1]Úvod!$G$8","v":"Baženov"}]
[]
["Ceník ISOLINE - LOCO žaluzií pro firmu"]
[{"$f":"'[1]Žaluzie KASKO'!$N$4","v":"INTERNET "}]
[]
["Typ:",null,"Sdružené ovládání pomocí řetízku - barva bílá, stříbrná, béžová, hnědá, světle hnědá"]
{"$rows_left_out":51}
{"sheet":"OBJ LOCO","index":5,"n_rows":33,"n_cols":40,"rows_kept":33,"cut":false,"hidden":false,"merged":[[2,0,2,4],[2,5,2,11],[2,12,2,13],[2,15,2,18],[0,0,0,18],[1,0,1,4],[1,5,1,11],[1,12,1,14],[1,15,1,18],[4,0,4,4],[4,5,4,6],[4,7,4,11],[4,12,4,13],[4,15,4,18],[3,0,3,4],[3,5,3,6],[3,7,3,11],[3,12,3,13],[3,15,3,18],[5,12,5,13],[5,15,5,18],[6,0,6,4],[6,5,6,6],[6,7,6,11],[6,12,7,13],[6,14,7,14],[6,15,6,18],[7,15,7,18],[8,3,9,3],[8,4,8,5],[5,0,5,4],[5,5,5,6],[5,7,5,11],[7,0,7,4],[7,5,7,6],[7,7,7,11],[32,0,32,18],[8,7,8,9],[8,14,9,14],[8,15,9,15],[8,16,9,16],[8,17,9,17],[8,18,9,18],[31,0,31,18],[8,6,9,6],[8,10,9,10],[8,11,9,11],[8,12,9,12],[8,13,9,13],[8,0,9,0],[8,1,9,1],[8,2,9,2]]}
["Objednávka žaluzií - ISOLINE LOCO"]
["Objednatel:",null,null,null,null,"List č. 1  z  1",null,null,null,null,null,null,"Souhrn objednávky:"]
[{"$f":"ISOLINE!A8","v":"INTERNET "},null,null,null,null,"(příklad: List č. 1   z.  5)",null,null,null,null,null,null,"Platnost od:",null,{"$f":"ISOLINE!$D$55","v":"2018-10-16"}]
[null,null,null,null,null,"Datum objednání:",null,null,null,null,null,null,"Plocha m²:",null,{"$f":"SUM(W11:W31)","v":0}]
[null,null,null,null,null,"Datum dodání:",null,null,null,null,null,null,"Kusů:",null,{"$f":"SUM(G11:G31)","v":0},"Stará 205, 789 61, Bludov"]
["IČ:",null,null,null,null,"Adresa dodání:",null,null,null,null,null,null,"Rabat, marže:",null,0,"Provozovna:"]
[null,null,null,null,null,"Kontakt:",null,null,null,null,null,null,"Přibližná cena bez DPH:",null,{"$f":"SUM(R11:R31)","v":0},"ul. Žerotínova 87, 787 01, Šumperk"]
[null,null,null,null,null,"Zakázka:",null,null,null,null,null,null,null,null,null,"bývalý areál Moravolenu (Bělidlo)"]
["Pozice","Lamela","Ovl.","Profil","Rozměr (v mm)",null,"ks","Barva",null,null,"Celostín","Rám okna","Podl. (pár)","Bezpeč. prvky","Délka ovl.         ( v mm)","m²","Cena kus","Cena celkem","Poznámka"]
[null,null,null,null,"Šířka","Výška",null,"Lamely","Profilů","LOCO lišty",null,null,null,null,null,null,null,null,null,null,null,null,"m2 řádek","šířka zaok","výška zaok","m2","příp barva lamela","příp barva profilu","příp barva loco","Index loco","příp síla lamely","Š index","V index","Cena index","Cena jednotka","Cena vše","Dist. Podložka","Bezpečnostní prvky","Marže ks","Marže vše"]
{"$rows_left_out":24}
{"sheet":"Tabulky","index":6,"n_rows":169,"n_cols":24,"rows_kept":169,"cut":false,"hidden":true,"merged":[]}
[]
["Příplatky:"]
[]
["25x18","Příplatek",null,"25x21","Příplatek",null,"16x21","Příplatek",null,null,"Horní a spodní profil","Příplatek",null,"Lamely",{"$f":"INDIRECT(\"Tabulky!\" &HLOOKUP('OBJ ISOLINE'!$B11,Tabulky!$A$4:$I$82,79,FALSE),1)","v":{"$error":"#N/A"}}]
[1,0,"m²",101,0,"m²",1,0,"m²",null,"Fe",0,"m²","Celostín",{"$f":"INDIRECT(\"Tabulky!\" &HLOOKUP(B11,Tabulky!$K$8:$M$11,4,FALSE),1)","v":{"$error":"#N/A"}},null,null,null,null,null,null,null,null,{"$f":"INDIRECT(\"Tabulky!\" &HLOOKUP(K11,Tabulky!K11K,79,FALSE),1)","v":{"$error":"#NAME?"}}]
[65,0,"m²",102,0,"m²",58,0,"m²",null,"Al",{"$f":"ISOLINE!$S$47","v":60},"m²"]
[103,0,"m²",107,0,"m²",872,0,"m²"]
[104,0,"m²",115,0,"m²",17,0,"m²",null,"25x18","25x21","16x21"]
[58,0,"m²",121,0,"m²",711,0,"m²",null,"ANO","ANO"]
[266,0,"m²",311,0,"m²",713,0,"m²",null,"NE","NE","NE"]
{"$rows_left_out":159}